BDBM50379449 CHEMBL2012262
SMILES Clc1ccccc1Cn1ccc2c(OC3CCN(Cc4cscn4)CC3)ncnc12
InChI Key InChIKey=JZGNUJUVVQHLMQ-UHFFFAOYSA-N
Data  2 IC50
  Tab Delimited (TSV)   2D SDfile   Computed 3D by Vconf -m prep SDfile
Find this compound or compounds like it in BindingDB:
Activity Spreadsheet -- Enzyme Inhibition Constant Data from BindingDB
Found 2 hits for monomerid = 50379449
TargetSodium channel protein type 9 subunit alpha(Homo sapiens (Human))
Amgen
Curated by ChEMBL
LigandPNGBDBM50379449(CHEMBL2012262)
Affinity DataIC50:  50nM. Assay description: Antagonist activity at human NaV1.7 channel by patchXpress assay
In DepthDetails ArticlePubMed
TargetSodium channel protein type 5 subunit alpha(Homo sapiens (Human))
Amgen
Curated by ChEMBL
LigandPNGBDBM50379449(CHEMBL2012262)
Affinity DataIC50:  110nM. Assay description: Antagonist activity at human NaV1.5 channel by patchXpress assay
In DepthDetails ArticlePubMed