BDBM50379457 CHEMBL2012272
SMILES Fc1c(Cl)cccc1Cn1ccc2c(OC3CCN(Cc4cscn4)CC3)ncnc12
InChI Key InChIKey=VNNYSEDDLCBJFP-UHFFFAOYSA-N
Data  1 KI  2 IC50
  Tab Delimited (TSV)   2D SDfile   Computed 3D by Vconf -m prep SDfile
Find this compound or compounds like it in BindingDB:
Activity Spreadsheet -- Enzyme Inhibition Constant Data from BindingDB
Found 3 hits for monomerid = 50379457
TargetPotassium voltage-gated channel subfamily H member 2(Homo sapiens (Human))
Amgen
Curated by ChEMBL
LigandPNGBDBM50379457(CHEMBL2012272)
Affinity DataKi:  950nM. Assay description: Displacement of dofetilide from human ERG
In DepthDetails ArticlePubMed
TargetSodium channel protein type 9 subunit alpha(Homo sapiens (Human))
Amgen
Curated by ChEMBL
LigandPNGBDBM50379457(CHEMBL2012272)
Affinity DataIC50:  20nM. Assay description: Antagonist activity at human NaV1.7 channel by patchXpress assay
In DepthDetails ArticlePubMed
TargetSodium channel protein type 5 subunit alpha(Homo sapiens (Human))
Amgen
Curated by ChEMBL
LigandPNGBDBM50379457(CHEMBL2012272)
Affinity DataIC50:  50nM. Assay description: Antagonist activity at human NaV1.5 channel by patchXpress assay
In DepthDetails ArticlePubMed