BDBM50379511 CHEMBL2012560
SMILES COc1ccc2c(c1)n(CCCCN)c1cnccc21
InChI Key InChIKey=HVQPRPBQJAJWRM-UHFFFAOYSA-N
Data  2 IC50
  Tab Delimited (TSV)   2D SDfile   Computed 3D by Vconf -m prep SDfile
Find this compound or compounds like it in BindingDB:
Activity Spreadsheet -- Enzyme Inhibition Constant Data from BindingDB
Found 2 hits for monomerid = 50379511
TargetSerine/threonine-protein kinase haspin(Homo sapiens (Human))
Harvard Medical School
Curated by ChEMBL
LigandPNGBDBM50379511(CHEMBL2012560)
Affinity DataIC50:  300nM. Assay description: Inhibition of human recombinant N-terminal MBP-tagged haspin kinase expressed in Escherichia coli DE3 after 10 mins by TR-FRET assay
In DepthDetails ArticlePubMed
TargetDual specificity tyrosine-phosphorylation-regulated kinase 2(Homo sapiens (Human))
Harvard Medical School
Curated by ChEMBL
LigandPNGBDBM50379511(CHEMBL2012560)
Affinity DataIC50: >1.00E+4nM. Assay description: Inhibition of human N-terminal GST-tagged DYRK2 expressed in baculovirus using DYRKtide-F as substrate assessed as inhibition of [33P] incorporation ...
In DepthDetails ArticlePubMed