BDBM50379528 CHEMBL2012565
SMILES Cc1nccc2c3ccc(NS(C)(=O)=O)cc3n(CCCCN)c12
InChI Key InChIKey=RIYODNJHOSJJLJ-UHFFFAOYSA-N
Data  2 IC50
  Tab Delimited (TSV)   2D SDfile   Computed 3D by Vconf -m prep SDfile
Find this compound or compounds like it in BindingDB:
Activity Spreadsheet -- Enzyme Inhibition Constant Data from BindingDB
Found 2 hits for monomerid = 50379528
TargetSerine/threonine-protein kinase haspin(Homo sapiens (Human))
Harvard Medical School
Curated by ChEMBL
LigandPNGBDBM50379528(CHEMBL2012565)
Affinity DataIC50:  690nM. Assay description: Inhibition of human recombinant N-terminal MBP-tagged haspin kinase expressed in Escherichia coli DE3 after 10 mins by TR-FRET assay
In DepthDetails ArticlePubMed
TargetDual specificity tyrosine-phosphorylation-regulated kinase 2(Homo sapiens (Human))
Harvard Medical School
Curated by ChEMBL
LigandPNGBDBM50379528(CHEMBL2012565)
Affinity DataIC50: >1.00E+4nM. Assay description: Inhibition of human N-terminal GST-tagged DYRK2 expressed in baculovirus using DYRKtide-F as substrate assessed as inhibition of [33P] incorporation ...
In DepthDetails ArticlePubMed