BDBM50379580 CHEMBL2012869
SMILES CN(C)CCCNCc1cc2n[nH]c(=O)n2c2cc(ccc12)-c1ccc[nH]1
InChI Key InChIKey=MJRDQBBBTINMDF-UHFFFAOYSA-N
Data  1 IC50
  Tab Delimited (TSV)   2D SDfile   Computed 3D by Vconf -m prep SDfile
Find this compound or compounds like it in BindingDB:
Activity Spreadsheet -- Enzyme Inhibition Constant Data from BindingDB
Found 1 hit for monomerid = 50379580
TargetSerine/threonine-protein kinase Chk1(Homo sapiens (Human))
Astrazeneca R&D Boston
Curated by ChEMBL
LigandPNGBDBM50379580(CHEMBL2012869)
Affinity DataIC50:  980nM. Assay description: Inhibition of Chk1
In DepthDetails ArticlePubMed