BDBM50379848 CHEMBL2011850
SMILES CCCCSc1c(ccc2c(N)ncnc12)-n1cc(C)c2c1CC(C)(C)CC2=O
InChI Key InChIKey=JWMNNGKBRMWHGI-UHFFFAOYSA-N
Data  1 IC50
  Tab Delimited (TSV)   2D SDfile   Computed 3D by Vconf -m prep SDfile
Find this compound or compounds like it in BindingDB:
Activity Spreadsheet -- Enzyme Inhibition Constant Data from BindingDB
Found 1 hit for monomerid = 50379848
TargetHeat shock protein HSP 90-beta(Homo sapiens (Human))
Serenex
Curated by ChEMBL
LigandPNGBDBM50379848(CHEMBL2011850)
Affinity DataIC50:  401nM. Assay description: Inhibition of HSP90-mediated Her2 degradation in human SKBR3 cells after 24 hrs by ELISA
In DepthDetails ArticlePubMed