BDBM50380090 CHEMBL2012891
SMILES Cn1c(Nc2ccc(I)cc2F)c(C(=O)NOC[C@@H](O)CO)c2CCCC(=O)c12
InChI Key InChIKey=WRVBDJLAGINJKL-NSHDSACASA-N
Data  1 IC50
  Tab Delimited (TSV)   2D SDfile   Computed 3D by Vconf -m prep SDfile
Find this compound or compounds like it in BindingDB:
Activity Spreadsheet -- Enzyme Inhibition Constant Data from BindingDB
Found 1 hit for monomerid = 50380090
TargetDual specificity mitogen-activated protein kinase kinase 1(Homo sapiens (Human))
Takeda California
Curated by ChEMBL
LigandPNGBDBM50380090(CHEMBL2012891)
Affinity DataIC50:  17nM. Assay description: Inhibition of MEK1-mediated ERK1 phosphorylation using IPTTPITTYFFFK-5FAM-COOH as substrate by fluorescent polarization assay
In DepthDetails ArticlePubMed