BDBM50380155 CHEMBL2010991
SMILES CCCc1cc(=O)[nH]c(SCC(=O)c2ccc(Cl)c(c2)S(N)(=O)=O)n1
InChI Key InChIKey=DTXFWJQCFZMMTP-UHFFFAOYSA-N
Data  14 Kd
  Tab Delimited (TSV)   2D SDfile   Computed 3D by Vconf -m prep SDfile
Find this compound or compounds like it in BindingDB:
Activity Spreadsheet -- Enzyme Inhibition Constant Data from BindingDB
Found 14 hits for monomerid = 50380155
TargetCarbonic anhydrase 13(Homo sapiens (Human))
Vilnius University
Curated by ChEMBL
LigandPNGBDBM50380155(CHEMBL2010991)
Affinity DataKd:  56nM. Assay description: Binding affinity to human recombinant carbonic anhydrase-13 by thermal shift assay
In DepthDetails ArticlePubMed
TargetCarbonic anhydrase 7(Homo sapiens (Human))
Vilnius University
Curated by ChEMBL
LigandPNGBDBM50380155(CHEMBL2010991)
Affinity DataKd:  74nM. Assay description: Binding affinity to human recombinant carbonic anhydrase-7 by isothermal titration calorimetry assay
In DepthDetails ArticlePubMed
TargetCarbonic anhydrase 7(Homo sapiens (Human))
Vilnius University
Curated by ChEMBL
LigandPNGBDBM50380155(CHEMBL2010991)
Affinity DataKd:  56nM. Assay description: Binding affinity to human recombinant carbonic anhydrase-7 by thermal shift assay
In DepthDetails ArticlePubMed
TargetCarbonic anhydrase 2(Homo sapiens (Human))
Vilnius University
Curated by ChEMBL
LigandPNGBDBM50380155(CHEMBL2010991)
Affinity DataKd:  79nM. Assay description: Binding affinity to human recombinant carbonic anhydrase-2 by isothermal titration calorimetry assay
In DepthDetails ArticlePubMed
TargetCarbonic anhydrase 2(Homo sapiens (Human))
Vilnius University
Curated by ChEMBL
LigandPNGBDBM50380155(CHEMBL2010991)
Affinity DataKd:  67nM. Assay description: Binding affinity to human recombinant carbonic anhydrase-2 by thermal shift assay
In DepthDetails ArticlePubMed
TargetCarbonic anhydrase 1(Homo sapiens (Human))
Vilnius University
Curated by ChEMBL
LigandPNGBDBM50380155(CHEMBL2010991)
Affinity DataKd:  750nM. Assay description: Binding affinity to human recombinant carbonic anhydrase-1 by isothermal titration calorimetry assay
In DepthDetails ArticlePubMed
TargetCarbonic anhydrase 1(Homo sapiens (Human))
Vilnius University
Curated by ChEMBL
LigandPNGBDBM50380155(CHEMBL2010991)
Affinity DataKd:  667nM. Assay description: Binding affinity to human recombinant carbonic anhydrase 1 expressed in Escherichia coli BL21 (DE3) by thermal shift assay
In DepthDetails ArticlePubMed
TargetCarbonic anhydrase 13(Homo sapiens (Human))
Vilnius University
Curated by ChEMBL
LigandPNGBDBM50380155(CHEMBL2010991)
Affinity DataKd:  81nM. Assay description: Binding affinity to human recombinant carbonic anhydrase-13 by isothermal titration calorimetry assay
In DepthDetails ArticlePubMed
TargetCarbonic anhydrase 13(Homo sapiens (Human))
Vilnius University
Curated by ChEMBL
LigandPNGBDBM50380155(CHEMBL2010991)
Affinity DataKd:  56nM. Assay description: Binding affinity to human recombinant carbonic anhydrase 13 by thermal shift assay
In DepthDetails ArticlePubMed
TargetCarbonic anhydrase 12(Homo sapiens (Human))
Vilnius University
Curated by ChEMBL
LigandPNGBDBM50380155(CHEMBL2010991)
Affinity DataKd:  100nM. Assay description: Binding affinity to human recombinant carbonic anhydrase 12 by thermal shift assay
In DepthDetails ArticlePubMed
TargetCarbonic anhydrase 6(Homo sapiens (Human))
Vilnius University
Curated by ChEMBL
LigandPNGBDBM50380155(CHEMBL2010991)
Affinity DataKd:  830nM. Assay description: Binding affinity to human recombinant carbonic anhydrase 6 expressed in Escherichia coli Rosetta2 (DE3) by thermal shift assay
In DepthDetails ArticlePubMed
TargetCarbonic anhydrase 2(Homo sapiens (Human))
Vilnius University
Curated by ChEMBL
LigandPNGBDBM50380155(CHEMBL2010991)
Affinity DataKd:  67nM. Assay description: Binding affinity to human recombinant carbonic anhydrase 2 by thermal shift assay
In DepthDetails ArticlePubMed
TargetCarbonic anhydrase 7(Homo sapiens (Human))
Vilnius University
Curated by ChEMBL
LigandPNGBDBM50380155(CHEMBL2010991)
Affinity DataKd:  56nM. Assay description: Binding affinity to human recombinant carbonic anhydrase 7 by thermal shift assay
In DepthDetails ArticlePubMed
TargetCarbonic anhydrase 1(Homo sapiens (Human))
Vilnius University
Curated by ChEMBL
LigandPNGBDBM50380155(CHEMBL2010991)
Affinity DataKd:  670nM. Assay description: Binding affinity to human recombinant carbonic anhydrase-1 by thermal shift assay
In DepthDetails ArticlePubMed