BDBM50380218 CHEMBL2011416
SMILES C[C@]12CC[C@H]3[C@@H](CCc4cc(OS(N)(=O)=O)c(cc34)C#N)[C@@H]1CCC2=O
InChI Key InChIKey=PAKPGTCJLPCIJC-MVWRLGRASA-N
Data  2 IC50
  Tab Delimited (TSV)   2D SDfile   Computed 3D by Vconf -m prep SDfile
Find this compound or compounds like it in BindingDB:
Activity Spreadsheet -- Enzyme Inhibition Constant Data from BindingDB
Found 2 hits for monomerid = 50380218
TargetSteryl-sulfatase(Homo sapiens (Human))
University Of Bath
Curated by ChEMBL
LigandPNGBDBM50380218(CHEMBL2011416)
Affinity DataIC50:  1.20nM. Assay description: Inhibition of steroid sulfatase in human MCF7 cells using [3H]E1S as substrate after 20 hrs by scintillation spectrometry
In DepthDetails ArticlePubMed
TargetSteryl-sulfatase(Homo sapiens (Human))
University Of Bath
Curated by ChEMBL
LigandPNGBDBM50380218(CHEMBL2011416)
Affinity DataIC50:  5.20nM. Assay description: Inhibition of steroid sulfatase in human placental microsomes using [3H]E1S as substrate after 30 mins by scintillation spectrometry
In DepthDetails ArticlePubMed