BDBM50380276 CHEMBL2017243
SMILES CSc1ccccc1Nc1nc(nc2c(NCCC3CC3)ncnc12)N1CCNCC1
InChI Key InChIKey=XJFHBBNECPEYDI-UHFFFAOYSA-N
Data  1 IC50
  Tab Delimited (TSV)   2D SDfile   Computed 3D by Vconf -m prep SDfile
Find this compound or compounds like it in BindingDB:
Activity Spreadsheet -- Enzyme Inhibition Constant Data from BindingDB
Found 1 hit for monomerid = 50380276
TargetKetohexokinase(Homo sapiens (Human))
TBA
Curated by ChEMBL
LigandPNGBDBM50380276(CHEMBL2017243)
Affinity DataIC50:  50nM. Assay description: Inhibition of human ketohexokinase isoform C expressed in Escherichia coli BL21 (DE3) cells using D-fructose as substrate after 12 to 15 mins by fluo...
In DepthDetails ArticlePubMed