BDBM50380305 CHEMBL2017459
SMILES CCN(C(=O)c1ccc(o1)-c1ccc(Cl)cc1)c1ccc(cc1)N1CCNCC1
InChI Key InChIKey=ZQXYAXCRCBTDIH-UHFFFAOYSA-N
Data  2 IC50  1 EC50
  Tab Delimited (TSV)   2D SDfile   Computed 3D by Vconf -m prep SDfile
Find this compound or compounds like it in BindingDB:
Activity Spreadsheet -- Enzyme Inhibition Constant Data from BindingDB
Found 3 hits for monomerid = 50380305
TargetMAP kinase-activated protein kinase 2(Homo sapiens (Human))
TBA
Curated by ChEMBL
LigandPNGBDBM50380305(CHEMBL2017459)
Affinity DataEC50:  800nM. Assay description: Inhibition of MK2-mediated HSP27 phosphorylation in IL-1beta stimulated human SW1353 cells incubated for 30 mins prior to IL-1beta-stimulation measur...
In DepthDetails ArticlePubMed
TargetMAP kinase-activated protein kinase 2(Homo sapiens (Human))
TBA
Curated by ChEMBL
LigandPNGBDBM50380305(CHEMBL2017459)
Affinity DataIC50:  130nM. Assay description: Inhibition of MK2 using Acam peptide as substrate incubated for 30 mins prior to substrate addition measured after 10 mins using 100 uM ATP by DELFIA...
In DepthDetails ArticlePubMed
TargetMAP kinase-activated protein kinase 2(Homo sapiens (Human))
TBA
Curated by ChEMBL
LigandPNGBDBM50380305(CHEMBL2017459)
Affinity DataIC50:  130nM. Assay description: Inhibition of MK2 (unknown origin) phosphorylation using TAMRA labeled peptide as substrate incubated 30 mins before substrate addition measured afte...
In DepthDetails ArticlePubMed