BDBM50380339 CHEMBL2017800
SMILES Oc1ccc(O)c(c1)C1NC(=O)C(C#N)=C(SCc2cccc(c2)N2CCOCC2)S1
InChI Key InChIKey=BBBSFJMLOSWVDM-UHFFFAOYSA-N
Data  1 IC50
  Tab Delimited (TSV)   2D SDfile   Computed 3D by Vconf -m prep SDfile
Find this compound or compounds like it in BindingDB:
Activity Spreadsheet -- Enzyme Inhibition Constant Data from BindingDB
Found 1 hit for monomerid = 50380339
TargetGalactokinase(Homo sapiens (Human))
TBA
Curated by ChEMBL
LigandPNGBDBM50380339(CHEMBL2017800)
Affinity DataIC50:  900nM. Assay description: Inhibition of human galactokinase after 30 mins by Kinase-GloTM assay
In DepthDetails ArticlePubMed