BDBM50380450 CHEMBL2018773
SMILES CCN(CC)CCOc1cc2c(Nc3ccc(Br)cc3F)ncnc2cc1OC
InChI Key InChIKey=FIABMQVFIWDJOZ-UHFFFAOYSA-N
Data  2 IC50
  Tab Delimited (TSV)   2D SDfile   Computed 3D by Vconf -m prep SDfile
Find this compound or compounds like it in BindingDB:
Activity Spreadsheet -- Enzyme Inhibition Constant Data from BindingDB
Found 2 hits for monomerid = 50380450
TargetEpidermal growth factor receptor(Homo sapiens (Human))
University Of Lille
Curated by ChEMBL
LigandPNGBDBM50380450(CHEMBL2018773)
Affinity DataIC50:  9.10E+3nM. Assay description: Inhibition of human EGFR expressed in human A431 cells using poly(Glu4/Tyr) and [gamma32P]ATP as substrate after 1 hr by scintillation counting
In DepthDetails ArticlePubMed
TargetVascular endothelial growth factor receptor 2(Homo sapiens (Human))
University Of Lille
Curated by ChEMBL
LigandPNGBDBM50380450(CHEMBL2018773)
Affinity DataIC50:  7.45E+3nM. Assay description: Inhibition of recombinant human VEGFR-2 using poly(Glu4/Tyr) and [gamma32P]ATP as substrate after 1 hr by scintillation counting
In DepthDetails ArticlePubMed