BDBM50380497 CHEMBL2018897
SMILES CCCCc1nc2c(N)nc3ccccc3c2n1Cc1ccc(CNC(=O)CCCCCCCCCCC(=O)NCc2ccc(Cn3c(CCCC)nc4c(N)nc5ccccc5c34)cc2)cc1
InChI Key InChIKey=XNDFWMCQDKMYHD-UHFFFAOYSA-N
Data  2 IC50
  Tab Delimited (TSV)   2D SDfile   Computed 3D by Vconf -m prep SDfile
Find this compound or compounds like it in BindingDB:
Activity Spreadsheet -- Enzyme Inhibition Constant Data from BindingDB
Found 2 hits for monomerid = 50380497
TargetToll-like receptor 8(Homo sapiens (Human))
University Of Kansas
Curated by ChEMBL
LigandPNGBDBM50380497(CHEMBL2018897)
Affinity DataIC50:  4.78E+3nM. Assay description: Agonist activity at human TLR8 expressed in HEK-Blue cells assessed as increase in NFkappaB activation by sAP reporter gene assay
In DepthDetails ArticlePubMed
TargetToll-like receptor 7(Homo sapiens (Human))
University Of Kansas
Curated by ChEMBL
LigandPNGBDBM50380497(CHEMBL2018897)
Affinity DataIC50:  170nM. Assay description: Agonist activity at human TLR7 expressed in HEK-Blue cells assessed as increase in NFkappaB activation by sAP reporter gene assay
In DepthDetails ArticlePubMed