BDBM50380538 CHEMBL2019029
SMILES O=C(NCCCCCCCCCNc1c2CCCCc2nc2ccccc12)c1cc(=O)c2ccccc2o1
InChI Key InChIKey=QPKOVCUUEVVGKK-UHFFFAOYSA-N
Data  2 IC50
  Tab Delimited (TSV)   2D SDfile   Computed 3D by Vconf -m prep SDfile
Find this compound or compounds like it in BindingDB:
Activity Spreadsheet -- Enzyme Inhibition Constant Data from BindingDB
Found 2 hits for monomerid = 50380538
TargetCholinesterase(Equus caballus (Horse))
Instituto De Qu£Mica M£Dica
Curated by ChEMBL
LigandPNGBDBM50380538(CHEMBL2019029)
Affinity DataIC50:  0.580nM. Assay description: Inhibition of horse serum BChE by Ellman's method
In DepthDetails ArticlePubMed
TargetAcetylcholinesterase(Bos taurus (bovine))
Instituto De Qu£Mica M£Dica
Curated by ChEMBL
LigandPNGBDBM50380538(CHEMBL2019029)
Affinity DataIC50:  125nM. Assay description: Inhibition of bovine erythrocytes AChE by Ellman's method
In DepthDetails ArticlePubMed