BDBM50380615 CHEMBL1459534
SMILES O=C1Nc2ccccc2C11OCC2(CO1)COC1(OC2)C(=O)Nc2ccccc12
InChI Key InChIKey=BTXRSHKJNDFHGA-UHFFFAOYSA-N
Data  1 IC50
  Tab Delimited (TSV)   2D SDfile   Computed 3D by Vconf -m prep SDfile
Find this compound or compounds like it in BindingDB:
Activity Spreadsheet -- Enzyme Inhibition Constant Data from BindingDB
Found 1 hit for monomerid = 50380615
TargetProtein Wnt-3a(Mus musculus)
Novartis Institutes For Biomedical Research
Curated by ChEMBL
LigandPNGBDBM50380615(CHEMBL1459534)
Affinity DataIC50:  1.17E+3nM. Assay description: Inhibition of mouse Wnt3A signaling in human HEK293 cells after 1 day by super top flash luciferase reporter gene assay
In DepthDetails ArticlePubMed