BDBM50380793 CHEMBL2018026
SMILES Nc1ncc(nc1C(=O)N[C@H]1C2CC3CC1C[C@@](O)(C3)C2)-c1cccc(c1)-c1cnn(CC(F)(F)F)c1
InChI Key InChIKey=BXPRYAOJTPDHTK-NNXBCOKFSA-N
Data  1 IC50
  Tab Delimited (TSV)   2D SDfile   Computed 3D by Vconf -m prep SDfile
Find this compound or compounds like it in BindingDB:
Activity Spreadsheet -- Enzyme Inhibition Constant Data from BindingDB
Found 1 hit for monomerid = 50380793
TargetTyrosine-protein kinase receptor TYRO3(Homo sapiens (Human))
RhôNe-Poulenc Rorer
Curated by ChEMBL
LigandPNGBDBM50380793(CHEMBL2018026)
Affinity DataIC50:  50nM. Assay description: Inhibition of human recombinant Sky using poly-GT as substrate and [33P]ATP after 40 mins by beta counting
In DepthDetails ArticlePubMed