BDBM50380795 CHEMBL2018028
SMILES CC(C)n1cc(cn1)-c1cccc(c1)-c1cnc(N)c(n1)C(=O)N[C@H]1C2CC3CC1C[C@@](O)(C3)C2
InChI Key InChIKey=UKAROZPZMLBYFI-AVDAYWBPSA-N
Data  1 IC50
  Tab Delimited (TSV)   2D SDfile   Computed 3D by Vconf -m prep SDfile
Find this compound or compounds like it in BindingDB:
Activity Spreadsheet -- Enzyme Inhibition Constant Data from BindingDB
Found 1 hit for monomerid = 50380795
TargetTyrosine-protein kinase receptor TYRO3(Homo sapiens (Human))
RhôNe-Poulenc Rorer
Curated by ChEMBL
LigandPNGBDBM50380795(CHEMBL2018028)
Affinity DataIC50:  40nM. Assay description: Inhibition of human recombinant Sky using poly-GT as substrate and [33P]ATP after 40 mins by beta counting
In DepthDetails ArticlePubMed