BDBM50380863 CHEMBL2018666
SMILES CC(C)(NC(=O)c1cc2CCCCCCc2n(CC2CCCCC2)c1=O)C(=O)N1CCC(CC1)C(N)=O
InChI Key InChIKey=YNBLMNMHRYWGHL-UHFFFAOYSA-N
Data  2 KI
  Tab Delimited (TSV)   2D SDfile   Computed 3D by Vconf -m prep SDfile
Find this compound or compounds like it in BindingDB:
Activity Spreadsheet -- Enzyme Inhibition Constant Data from BindingDB
Found 2 hits for monomerid = 50380863
TargetCannabinoid receptor 2(Homo sapiens (Human))
Shionogi
Curated by ChEMBL
LigandPNGBDBM50380863(CHEMBL2018666)
Affinity DataKi:  3nM. Assay description: Displacement of [3H]-CP55940 from recombinant human CB2 receptor by scatchard plot analysis
In DepthDetails ArticlePubMed
TargetCannabinoid receptor 1(Homo sapiens (Human))
Shionogi
Curated by ChEMBL
LigandPNGBDBM50380863(CHEMBL2018666)
Affinity DataKi:  4.90nM. Assay description: Displacement of [3H]-CP55940 from recombinant human CB1 receptor by scatchard plot analysis
In DepthDetails ArticlePubMed