BDBM50380869 CHEMBL2018956
SMILES COc1ccccc1Cn1nc(NS(=O)(=O)c2ccc(Cl)s2)c2c(OC)cccc12
InChI Key InChIKey=PUATYFVTKCFLQQ-UHFFFAOYSA-N
Data  1 KI
  Tab Delimited (TSV)   2D SDfile   Computed 3D by Vconf -m prep SDfile
Find this compound or compounds like it in BindingDB:
Activity Spreadsheet -- Enzyme Inhibition Constant Data from BindingDB
Found 1 hit for monomerid = 50380869
TargetC-C chemokine receptor type 4(Homo sapiens (Human))
Glaxosmithkline
Curated by ChEMBL
LigandPNGBDBM50380869(CHEMBL2018956)
Affinity DataKi:  158nM. Assay description: Displacement of [125I]TARC from human CCR4 expressed in CHO membranes by SPA
In DepthDetails ArticlePubMed