BDBM50380946 CHEMBL2016900
SMILES Fc1ccc2[nH]c(=O)c(cc2c1)-c1nc2CCN(Cc2[nH]1)C(=O)c1cccnc1
InChI Key InChIKey=YBOJYRLDNAYSID-UHFFFAOYSA-N
Data  1 IC50
  Tab Delimited (TSV)   2D SDfile   Computed 3D by Vconf -m prep SDfile
Find this compound or compounds like it in BindingDB:
Activity Spreadsheet -- Enzyme Inhibition Constant Data from BindingDB
Found 1 hit for monomerid = 50380946
TargetVascular endothelial growth factor receptor 2(Homo sapiens (Human))
Korea Research Institute Of Chemical Technology
Curated by ChEMBL
LigandPNGBDBM50380946(CHEMBL2016900)
Affinity DataIC50:  1nM. Assay description: Inhibition of recombinant VEGFR-2 kinase domain by homogeneous time-resolved fluorescence assay
In DepthDetails ArticlePubMed