BDBM50381026 CHEMBL2017141
SMILES CN([C@H]1CCC23Cc4ccc(O)cc4C2(CCN(CC2CC2)C3)C1)C(=O)CCc1ccccc1
InChI Key InChIKey=NPBSNTUICXFOJZ-OAHPJDTOSA-N
Data  3 KI
  Tab Delimited (TSV)   2D SDfile   Computed 3D by Vconf -m prep SDfile
Find this compound or compounds like it in BindingDB:
Activity Spreadsheet -- Enzyme Inhibition Constant Data from BindingDB
Found 3 hits for monomerid = 50381026
TargetMu-type opioid receptor(MOUSE)
Kitasato University
Curated by ChEMBL
LigandPNGBDBM50381026(CHEMBL2017141)
Affinity DataKi:  1.23nM. Assay description: Displacement of [3H]DAMGO from mu opioid receptor in mouse whole brain without cerebellum
In DepthDetails ArticlePubMed
TargetKappa-type opioid receptor(Cavia porcellus (domestic guinea pig))
Kitasato University
Curated by ChEMBL
LigandPNGBDBM50381026(CHEMBL2017141)
Affinity DataKi:  7.10nM. Assay description: Displacement of [3H]U69593 from kappa opioid receptor in guinea pig cerebellum
In DepthDetails ArticlePubMed
TargetMu-type opioid receptor(MOUSE)
Kitasato University
Curated by ChEMBL
LigandPNGBDBM50381026(CHEMBL2017141)
Affinity DataKi:  44.3nM. Assay description: Displacement of [3H]DPDPE from delta opioid receptor in mouse whole brain without cerebellum
In DepthDetails ArticlePubMed