BDBM50381077 CHEMBL2017374
SMILES CC(=O)N1CCC(CC1)C(=O)N(CCCN1CCN(Cc2ccc(F)cc2)CC1)c1ccc(C)c(Cl)c1
InChI Key InChIKey=ZAMLSFUEYHPQPA-UHFFFAOYSA-N
Data  1 IC50
  Tab Delimited (TSV)   2D SDfile   Computed 3D by Vconf -m prep SDfile
Find this compound or compounds like it in BindingDB:
Activity Spreadsheet -- Enzyme Inhibition Constant Data from BindingDB
Found 1 hit for monomerid = 50381077
TargetPotassium voltage-gated channel subfamily H member 2(Homo sapiens (Human))
Beijing Institute Of Biotechnology
Curated by ChEMBL
LigandPNGBDBM50381077(CHEMBL2017374)
Affinity DataIC50:  1.82E+3nM. Assay description: Inhibition of human Erg expressed in HEK293 cells by whole cell patch clamp assay
In DepthDetails ArticlePubMed