BDBM50381480 CHEMBL2017750
SMILES Cc1nc(nc2ccc(NC(=O)\C=C\c3ccc(OC(F)(F)F)cc3)cc12)N1CCC(CC1)N1CCOC1=O
InChI Key InChIKey=MAPBXAOIQWVKOY-RUDMXATFSA-N
Data  2 IC50
  Tab Delimited (TSV)   2D SDfile   Computed 3D by Vconf -m prep SDfile
Find this compound or compounds like it in BindingDB:
Activity Spreadsheet -- Enzyme Inhibition Constant Data from BindingDB
Found 2 hits for monomerid = 50381480
TargetMelanin-concentrating hormone receptor 1(Homo sapiens (Human))
Dr. Reddy'S Laboratories
Curated by ChEMBL
LigandPNGBDBM50381480(CHEMBL2017750)
Affinity DataIC50:  41nM. Assay description: Displacement of [125-I]MCH from human recombinant MCHR1 expressed in CHO-K1 cell membranes after 2 hrs by scintillation proximity assay
In DepthDetails ArticlePubMed
TargetMelanin-concentrating hormone receptor 1(Homo sapiens (Human))
Dr. Reddy'S Laboratories
Curated by ChEMBL
LigandPNGBDBM50381480(CHEMBL2017750)
Affinity DataIC50:  31nM. Assay description: Antagonist activity at human recombinant MCHR1 expressed in CHO-K1 cells assessed as inhibition of MCH-induced IP3 accumulation response preincubated...
In DepthDetails ArticlePubMed