BDBM50381502 CHEMBL2017612
SMILES Cc1nc(NCCCO)nc2ccc(NC(=O)\C=C\c3ccc(OC(F)(F)F)cc3)cc12
InChI Key InChIKey=HWRFEBLGDJTYHJ-BJMVGYQFSA-N
Data  2 IC50
  Tab Delimited (TSV)   2D SDfile   Computed 3D by Vconf -m prep SDfile
Find this compound or compounds like it in BindingDB:
Activity Spreadsheet -- Enzyme Inhibition Constant Data from BindingDB
Found 2 hits for monomerid = 50381502
TargetMelanin-concentrating hormone receptor 1(Homo sapiens (Human))
Dr. Reddy'S Laboratories
Curated by ChEMBL
LigandPNGBDBM50381502(CHEMBL2017612)
Affinity DataIC50:  30nM. Assay description: Antagonist activity at human recombinant MCHR1 expressed in CHO-K1 cells assessed as inhibition of MCH-induced IP3 accumulation response preincubated...
In DepthDetails ArticlePubMed
TargetMelanin-concentrating hormone receptor 1(Homo sapiens (Human))
Dr. Reddy'S Laboratories
Curated by ChEMBL
LigandPNGBDBM50381502(CHEMBL2017612)
Affinity DataIC50:  36nM. Assay description: Displacement of [125-I]MCH from human recombinant MCHR1 expressed in CHO-K1 cell membranes after 2 hrs by scintillation proximity assay
In DepthDetails ArticlePubMed