BDBM50381511 CHEMBL2017742
SMILES Cc1nc(nc2ccc(NC(=O)C=Cc3ccc(OC(F)(F)F)cc3)cc12)N1CCC(CC1)N1CCOCC1=O
InChI Key InChIKey=NKOTWZZRMWMDNI-UHFFFAOYSA-N
Data  2 IC50
  Tab Delimited (TSV)   2D SDfile   Computed 3D by Vconf -m prep SDfile
Find this compound or compounds like it in BindingDB:
Activity Spreadsheet -- Enzyme Inhibition Constant Data from BindingDB
Found 2 hits for monomerid = 50381511
TargetMelanin-concentrating hormone receptor 1(Homo sapiens (Human))
Dr. Reddy'S Laboratories
Curated by ChEMBL
LigandPNGBDBM50381511(CHEMBL2017742)
Affinity DataIC50:  13nM. Assay description: Antagonist activity at human recombinant MCHR1 expressed in CHO-K1 cells assessed as inhibition of MCH-induced IP3 accumulation response preincubated...
In DepthDetails ArticlePubMed
TargetMelanin-concentrating hormone receptor 1(Homo sapiens (Human))
Dr. Reddy'S Laboratories
Curated by ChEMBL
LigandPNGBDBM50381511(CHEMBL2017742)
Affinity DataIC50:  30nM. Assay description: Displacement of [125-I]MCH from human recombinant MCHR1 expressed in CHO-K1 cell membranes after 2 hrs by scintillation proximity assay
In DepthDetails ArticlePubMed