BDBM50381568 CHEMBL2018137
SMILES COc1ccccc1N1C(=S)O\C(=C/c2ccc(O)c(Br)c2)C1=O
InChI Key InChIKey=AGIUPEBSBDBNGH-DHDCSXOGSA-N
Data  1 IC50
  Tab Delimited (TSV)   2D SDfile   Computed 3D by Vconf -m prep SDfile
Find this compound or compounds like it in BindingDB:
Activity Spreadsheet -- Enzyme Inhibition Constant Data from BindingDB
Found 1 hit for monomerid = 50381568
Target17-beta-hydroxysteroid dehydrogenase type 3(Homo sapiens (Human))
Sumitomo Chemical
Curated by ChEMBL
LigandPNGBDBM50381568(CHEMBL2018137)
Affinity DataIC50:  60nM. Assay description: Inhibition of human recombinant 17-beta-HSD3 expressed in human HeLa cells using androstenedione as substrate preincubated for 30 mins prior substrat...
In DepthDetails ArticlePubMed