BDBM50381583 CHEMBL2018234
SMILES CS(=O)(=O)c1ccc(cc1)N1C(=O)O\C(=C/c2ccc(O)c(Br)c2)C1=O
InChI Key InChIKey=OVDIKNPNLFVGBJ-DHDCSXOGSA-N
Data  1 IC50
  Tab Delimited (TSV)   2D SDfile   Computed 3D by Vconf -m prep SDfile
Find this compound or compounds like it in BindingDB:
Activity Spreadsheet -- Enzyme Inhibition Constant Data from BindingDB
Found 1 hit for monomerid = 50381583
Target17-beta-hydroxysteroid dehydrogenase type 3(Homo sapiens (Human))
Sumitomo Chemical
Curated by ChEMBL
LigandPNGBDBM50381583(CHEMBL2018234)
Affinity DataIC50:  900nM. Assay description: Inhibition of human recombinant 17-beta-HSD3 expressed in human HeLa cells using androstenedione as substrate preincubated for 30 mins prior substrat...
In DepthDetails ArticlePubMed