BDBM50381593 CHEMBL2018246
SMILES COc1ccc(cc1)N1C(=S)O\C(=C/c2ccc(O)cc2)C1=O
InChI Key InChIKey=HIARYVBUAJHLLG-GDNBJRDFSA-N
Data  1 IC50
  Tab Delimited (TSV)   2D SDfile   Computed 3D by Vconf -m prep SDfile
Find this compound or compounds like it in BindingDB:
Activity Spreadsheet -- Enzyme Inhibition Constant Data from BindingDB
Found 1 hit for monomerid = 50381593
Target17-beta-hydroxysteroid dehydrogenase type 3(Homo sapiens (Human))
Sumitomo Chemical
Curated by ChEMBL
LigandPNGBDBM50381593(CHEMBL2018246)
Affinity DataIC50:  121nM. Assay description: Inhibition of human recombinant 17-beta-HSD3 expressed in human HeLa cells using androstenedione as substrate preincubated for 30 mins prior substrat...
In DepthDetails ArticlePubMed