BDBM50381999 CHEMBL2022114
SMILES Cc1cn2c(cnc2c(Nc2cc(CN3CCCCC3)ns2)n1)-c1cnn(CC(N)=O)c1
InChI Key InChIKey=FNJZLMRGBUFJDP-UHFFFAOYSA-N
Data  2 IC50  1 EC50
  Tab Delimited (TSV)   2D SDfile   Computed 3D by Vconf -m prep SDfile
Find this compound or compounds like it in BindingDB:
Activity Spreadsheet -- Enzyme Inhibition Constant Data from BindingDB
Found 3 hits for monomerid = 50381999
TargetAurora kinase B(Homo sapiens (Human))
Amri
Curated by ChEMBL
LigandPNGBDBM50381999(CHEMBL2022114)
Affinity DataIC50:  28nM. Assay description: Inhibition of aurora B kinase using 5TAMRA-GRTGRRNSICOOH as substrate by fluorescent assay
In DepthDetails ArticlePubMed
TargetAurora kinase A(Homo sapiens (Human))
Amri
Curated by ChEMBL
LigandPNGBDBM50381999(CHEMBL2022114)
Affinity DataIC50:  1.57E+3nM. Assay description: Inhibition of aurora A kinase using 5TAMRA-GRTGRRNSICOOH as substrate by fluorescent assay
In DepthDetails ArticlePubMed
TargetAurora kinase B(Homo sapiens (Human))
Amri
Curated by ChEMBL
LigandPNGBDBM50381999(CHEMBL2022114)
Affinity DataEC50: >1.00E+3nM. Assay description: Inhibition of aurora B kinase in human HCT116 cells assessed as inhibition of histone H3 phosphorylation incubated for 1 hr by Hoechst 33342 staining...
In DepthDetails ArticlePubMed