BDBM50382590 CHEMBL2022983
SMILES CC(C)c1cccc(c1)C(SCCN)(c1ccccc1)c1ccccc1
InChI Key InChIKey=HXZJSAFVSYFVCZ-UHFFFAOYSA-N
Data  1 KI
  Tab Delimited (TSV)   2D SDfile   Computed 3D by Vconf -m prep SDfile
Find this compound or compounds like it in BindingDB:
Activity Spreadsheet -- Enzyme Inhibition Constant Data from BindingDB
Found 1 hit for monomerid = 50382590
TargetKinesin-like protein KIF11(Homo sapiens (Human))
The Beatson Institute For Cancer Research
Curated by ChEMBL
LigandPNGBDBM50382590(CHEMBL2022983)
Affinity DataKi:  10.3nM. Assay description: Inhibition of N-terminal hexa-histidine tagged human cloned Eg5 (1 to 368 amino acids) expressed in Escherichia coli BL21 (DE3) assessed as reduction...
In DepthDetails ArticlePubMed