BDBM50382655 CHEMBL2023994
SMILES COc1cc(Nc2nccc(n2)N2CCC[C@@H](C2)C(=O)NCc2cccc(c2)[N+]([O-])=O)cc(OC)c1OC
InChI Key InChIKey=PZZSEHAIVIYFLT-SFHVURJKSA-N
Data  2 IC50
  Tab Delimited (TSV)   2D SDfile   Computed 3D by Vconf -m prep SDfile
Find this compound or compounds like it in BindingDB:
Activity Spreadsheet -- Enzyme Inhibition Constant Data from BindingDB
Found 2 hits for monomerid = 50382655
TargetInsulin-like growth factor 1 receptor(Homo sapiens (Human))
Amgen
Curated by ChEMBL
LigandPNGBDBM50382655(CHEMBL2023994)
Affinity DataIC50:  503nM. Assay description: Inhibition of human N-terminal GST-fused IGF1R cytoplasmic domain (960 to 1367) expressed in Hi5 cells using Biotin- Ahx- EEEEAYGWLDF-OH as substrate...
In DepthDetails ArticlePubMed
TargetALK tyrosine kinase receptor(Homo sapiens (Human))
Amgen
Curated by ChEMBL
LigandPNGBDBM50382655(CHEMBL2023994)
Affinity DataIC50:  70nM. Assay description: Inhibition of human N-terminal GST-fused ALK cytoplasmic domain (1058 to 1620) expressed in SF9 cells using Biotin-Ahx- EQEDEPEGIYGVLF-OH as substrat...
In DepthDetails ArticlePubMed