BDBM50382661 CHEMBL2023555
SMILES COc1cc(Nc2nccc(n2)N2CCC[C@@H](C2)C(=O)NCc2cccc(C)c2)cc(OC)c1OC
InChI Key InChIKey=OZNRQZFKHOJXCQ-FQEVSTJZSA-N
Data  2 IC50
  Tab Delimited (TSV)   2D SDfile   Computed 3D by Vconf -m prep SDfile
Find this compound or compounds like it in BindingDB:
Activity Spreadsheet -- Enzyme Inhibition Constant Data from BindingDB
Found 2 hits for monomerid = 50382661
TargetALK tyrosine kinase receptor(Homo sapiens (Human))
Amgen
Curated by ChEMBL
LigandPNGBDBM50382661(CHEMBL2023555)
Affinity DataIC50:  83nM. Assay description: Inhibition of human N-terminal GST-fused ALK cytoplasmic domain (1058 to 1620) expressed in SF9 cells using Biotin-Ahx- EQEDEPEGIYGVLF-OH as substrat...
In DepthDetails ArticlePubMed
TargetInsulin-like growth factor 1 receptor(Homo sapiens (Human))
Amgen
Curated by ChEMBL
LigandPNGBDBM50382661(CHEMBL2023555)
Affinity DataIC50:  722nM. Assay description: Inhibition of human N-terminal GST-fused IGF1R cytoplasmic domain (960 to 1367) expressed in Hi5 cells using Biotin- Ahx- EEEEAYGWLDF-OH as substrate...
In DepthDetails ArticlePubMed