BDBM50382672 CHEMBL2024005
SMILES Nc1nc2n(cnc2c(=O)[nH]1)[C@@H]1CN(C[C@@H]1O)C(=O)P(O)(O)=O
InChI Key InChIKey=FVXOQJONSZSXSW-UHNVWZDZSA-N
Data  14 KI  1 IC50
  Tab Delimited (TSV)   2D SDfile   Computed 3D by Vconf -m prep SDfile
Find this compound or compounds like it in BindingDB:
Activity Spreadsheet -- Enzyme Inhibition Constant Data from BindingDB
Found 15 hits for monomerid = 50382672
TargetPurine nucleoside phosphorylase(Homo sapiens (Human))
Academy Of Sciences Of The Czech Republic
Curated by ChEMBL
LigandPNGBDBM50382672(CHEMBL2024005)
Affinity DataKi:  6nM. Assay description: Competitive inhibition of PNP in human DoHH2 cells using MSEG as substrate by Dixon-plot analysis
In DepthDetails ArticlePubMed
TargetPurine nucleoside phosphorylase(Homo sapiens (Human))
Academy Of Sciences Of The Czech Republic
Curated by ChEMBL
LigandPNGBDBM50382672(CHEMBL2024005)
Affinity DataKi:  7nM. Assay description: Competitive inhibition of human recombinant PNP using MSEG as substrate by Dixon-plot analysis
In DepthDetails ArticlePubMed
TargetPurine nucleoside phosphorylase(Homo sapiens (Human))
Academy Of Sciences Of The Czech Republic
Curated by ChEMBL
LigandPNGBDBM50382672(CHEMBL2024005)
Affinity DataKi:  10nM. Assay description: Competitive inhibition of PNP in human Jurkat cells using MSEG as substrate by Dixon-plot analysis
In DepthDetails ArticlePubMed
TargetPurine nucleoside phosphorylase(Homo sapiens (Human))
Academy Of Sciences Of The Czech Republic
Curated by ChEMBL
LigandPNGBDBM50382672(CHEMBL2024005)
Affinity DataKi:  10nM. Assay description: Competitive inhibition of PNP in human PBMC using MSEG as substrate by Dixon-plot analysis
In DepthDetails ArticlePubMed
TargetPurine nucleoside phosphorylase(Homo sapiens (Human))
Academy Of Sciences Of The Czech Republic
Curated by ChEMBL
LigandPNGBDBM50382672(CHEMBL2024005)
Affinity DataKi:  10nM. Assay description: Competitive inhibition of PNP in human K562 cells using MSEG as substrate by Dixon-plot analysis
In DepthDetails ArticlePubMed
TargetPurine nucleoside phosphorylase(Homo sapiens (Human))
Academy Of Sciences Of The Czech Republic
Curated by ChEMBL
LigandPNGBDBM50382672(CHEMBL2024005)
Affinity DataKi:  10nM. Assay description: Competitive inhibition of PNP in human MINO cells using MSEG as substrate by Dixon-plot analysis
In DepthDetails ArticlePubMed
TargetPurine nucleoside phosphorylase(Homo sapiens (Human))
Academy Of Sciences Of The Czech Republic
Curated by ChEMBL
LigandPNGBDBM50382672(CHEMBL2024005)
Affinity DataKi:  11nM. Assay description: Competitive inhibition of PNP in human MC116 cells using MSEG as substrate by Dixon-plot analysis
In DepthDetails ArticlePubMed
TargetPurine nucleoside phosphorylase(Homo sapiens (Human))
Academy Of Sciences Of The Czech Republic
Curated by ChEMBL
LigandPNGBDBM50382672(CHEMBL2024005)
Affinity DataKi:  11nM. Assay description: Competitive inhibition of PNP in human SU-DHL-1 cells using MSEG as substrate by Dixon-plot analysis
In DepthDetails ArticlePubMed
TargetPurine nucleoside phosphorylase(Homo sapiens (Human))
Academy Of Sciences Of The Czech Republic
Curated by ChEMBL
LigandPNGBDBM50382672(CHEMBL2024005)
Affinity DataKi:  12nM. Assay description: Competitive inhibition of PNP in human AML cells obtained from patients using MSEG as substrate by Dixon-plot analysis
In DepthDetails ArticlePubMed
TargetPurine nucleoside phosphorylase(Homo sapiens (Human))
Academy Of Sciences Of The Czech Republic
Curated by ChEMBL
LigandPNGBDBM50382672(CHEMBL2024005)
Affinity DataKi:  14nM. Assay description: Competitive inhibition of PNP in human CML cells obtained from patients using MSEG as substrate by Dixon-plot analysis
In DepthDetails ArticlePubMed
TargetPurine nucleoside phosphorylase(Homo sapiens (Human))
Academy Of Sciences Of The Czech Republic
Curated by ChEMBL
LigandPNGBDBM50382672(CHEMBL2024005)
Affinity DataKi:  16nM. Assay description: Competitive inhibition of PNP in human OPM2 cells using MSEG as substrate by Dixon-plot analysis
In DepthDetails ArticlePubMed
TargetPurine nucleoside phosphorylase(Homo sapiens (Human))
Academy Of Sciences Of The Czech Republic
Curated by ChEMBL
LigandPNGBDBM50382672(CHEMBL2024005)
Affinity DataKi:  16nM. Assay description: Competitive inhibition of PNP in human HBL2 cells using MSEG as substrate by Dixon-plot analysis
In DepthDetails ArticlePubMed
TargetPurine nucleoside phosphorylase(Homo sapiens (Human))
Academy Of Sciences Of The Czech Republic
Curated by ChEMBL
LigandPNGBDBM50382672(CHEMBL2024005)
Affinity DataKi:  20nM. Assay description: Competitive inhibition of PNP in human RPMI8226 cells using MSEG as substrate by Dixon-plot analysis
In DepthDetails ArticlePubMed
TargetPurine nucleoside phosphorylase(Homo sapiens (Human))
Academy Of Sciences Of The Czech Republic
Curated by ChEMBL
LigandPNGBDBM50382672(CHEMBL2024005)
Affinity DataKi:  24nM. Assay description: Competitive inhibition of PNP in human HBL2 tumor cells using MSEG as substrate by Dixon-plot analysis
In DepthDetails ArticlePubMed
TargetPurine nucleoside phosphorylase(Homo sapiens (Human))
Academy Of Sciences Of The Czech Republic
Curated by ChEMBL
LigandPNGBDBM50382672(CHEMBL2024005)
Affinity DataIC50:  10nM. Assay description: Inhibition of human recombinant PNP using MSEG as substrate preincubated with inhibitor within 10 to 20 mins measured after 5 mins by HPLC analysis
In DepthDetails ArticlePubMed