BDBM50382735 CHEMBL2024377
SMILES C[C@H](COc1ccc(cc1)C(=O)c1c(sc2cc(O)ccc12)-c1ccc(O)cc1)N1CCCC1
InChI Key InChIKey=UQRWUYACRDDBAE-GOSISDBHSA-N
Data  2 IC50
  Tab Delimited (TSV)   2D SDfile   Computed 3D by Vconf -m prep SDfile
Find this compound or compounds like it in BindingDB:
Activity Spreadsheet -- Enzyme Inhibition Constant Data from BindingDB
Found 2 hits for monomerid = 50382735
TargetEstrogen receptor beta(Homo sapiens (Human))
Torrey Pines Institute For Molecular Studies
Curated by ChEMBL
LigandPNGBDBM50382735(CHEMBL2024377)
Affinity DataIC50:  2.60nM. Assay description: Displacement of [3H]-estradiol from human full length recombinant ERbeta by scintillation proximity assay
In DepthDetails ArticlePubMed
TargetEstrogen receptor(Homo sapiens (Human))
Torrey Pines Institute For Molecular Studies
Curated by ChEMBL
LigandPNGBDBM50382735(CHEMBL2024377)
Affinity DataIC50:  0.200nM. Assay description: Displacement of [3H]-estradiol from human full length recombinant ERalpha by scintillation proximity assay
In DepthDetails ArticlePubMed