BDBM50383340 CHEMBL2029794
SMILES CC(C)CCn1ccc(-c2ccc(OCC3CC3)c(Cl)c2)c(C#N)c1=O
InChI Key InChIKey=NMBQWHULIFALHE-UHFFFAOYSA-N
Data  1 EC50
  Tab Delimited (TSV)   2D SDfile   Computed 3D by Vconf -m prep SDfile
Find this compound or compounds like it in BindingDB:
Activity Spreadsheet -- Enzyme Inhibition Constant Data from BindingDB
Found 1 hit for monomerid = 50383340
TargetMetabotropic glutamate receptor 2(Homo sapiens (Human))
Janssen-Cilag
Curated by ChEMBL
LigandPNGBDBM50383340(CHEMBL2029794)
Affinity DataEC50:  110nM. Assay description: Positive allosteric modulation of human mGlu2 receptor expressed in CHO cells assessed as glutamate-induced [35S]GTPgammaS binding after 30 mins by l...
In DepthDetails ArticlePubMed