BDBM50383619 CHEMBL2029645
SMILES NC(=O)CS(=O)C1c2ccccc2-c2ccccc12
InChI Key InChIKey=GOWLVDTWVMLOCH-UHFFFAOYSA-N
Data  2 IC50
  Tab Delimited (TSV)   2D SDfile   Computed 3D by Vconf -m prep SDfile
Find this compound or compounds like it in BindingDB:
Activity Spreadsheet -- Enzyme Inhibition Constant Data from BindingDB
Found 2 hits for monomerid = 50383619
TargetSodium-dependent dopamine transporter(Rattus norvegicus (rat))
Cephalon
Curated by ChEMBL
LigandPNGBDBM50383619(CHEMBL2029645)
Affinity DataIC50: >1.00E+5nM. Assay description: Displacement of 3H-WIN-35428 from DAT in rat striata after 120 mins
In DepthDetails ArticlePubMed
TargetCytochrome P450 2C19(Homo sapiens (Human))
Cephalon
Curated by ChEMBL
LigandPNGBDBM50383619(CHEMBL2029645)
Affinity DataIC50: >1.00E+5nM. Assay description: Inhibition of CYP2C19
In DepthDetails ArticlePubMed