BDBM50383686 CHEMBL2030116
SMILES CCc1nn(Cc2ccc3ccccc3c2)c(CC)c1CC(O)=O
InChI Key InChIKey=FNSPOFPMEJRIFH-UHFFFAOYSA-N
Data  1 KI
  Tab Delimited (TSV)   2D SDfile   Computed 3D by Vconf -m prep SDfile
Find this compound or compounds like it in BindingDB:
Activity Spreadsheet -- Enzyme Inhibition Constant Data from BindingDB
Found 1 hit for monomerid = 50383686
TargetProstaglandin D2 receptor 2(Homo sapiens (Human))
Pfizer
Curated by ChEMBL
LigandPNGBDBM50383686(CHEMBL2030116)
Affinity DataKi:  574nM. Assay description: Displacement of [3H]PGD2 from human CRTH2 receptor expressed in CHO cell membrane after 120 mins by scintillation counting
In DepthDetails ArticlePubMed