BDBM50383718 CHEMBL2030378
SMILES O[C@H]1CCN(Cc2nc3c4cc(Cl)ccc4oc3c(=O)[nH]2)C1
InChI Key InChIKey=OOWARGUCASJZNQ-VIFPVBQESA-N
Data  1 IC50
  Tab Delimited (TSV)   2D SDfile   Computed 3D by Vconf -m prep SDfile
Find this compound or compounds like it in BindingDB:
Activity Spreadsheet -- Enzyme Inhibition Constant Data from BindingDB
Found 1 hit for monomerid = 50383718
TargetCell division cycle 7-related protein kinase(Homo sapiens (Human))
Exelixis
Curated by ChEMBL
LigandPNGBDBM50383718(CHEMBL2030378)
Affinity DataIC50:  2.20E+3nM. Assay description: Inhibition of N-terminus Myc-tagged human CDC7 expressed in Escherichia coli by chemiluminescence assay in presence of ATP
In DepthDetails ArticlePubMed