BDBM50383771 CHEMBL2030602
SMILES COc1ccc(cc1Cl)C1C(C=NC=C1C(=O)OC\C=C\c1ccccc1)C(O)=O
InChI Key InChIKey=VOCNYHMOYGBBEA-VMPITWQZSA-N
Data  1 IC50
  Tab Delimited (TSV)   2D SDfile   Computed 3D by Vconf -m prep SDfile
Find this compound or compounds like it in BindingDB:
Activity Spreadsheet -- Enzyme Inhibition Constant Data from BindingDB
Found 1 hit for monomerid = 50383771
TargetVoltage-dependent N-type calcium channel subunit alpha-1B(Homo sapiens (Human))
Ajinomoto Pharmaceuticals
Curated by ChEMBL
LigandPNGBDBM50383771(CHEMBL2030602)
Affinity DataIC50:  1.30E+3nM. Assay description: Inhibition of N-type voltage-dependent calcium channel CaV2.2 in human IMR32 cells assessed as inhibition of KCl-induced increase in intracellular ca...
In DepthDetails ArticlePubMed