BDBM50384272 CHEMBL2030611
SMILES CC(C)c1nc(SCc2cc(C)ccc2C)[nH]c(=O)c1C#N
InChI Key InChIKey=GQYDCULPSPQRKW-UHFFFAOYSA-N
Data  1 IC50
  Tab Delimited (TSV)   2D SDfile   Computed 3D by Vconf -m prep SDfile
Find this compound or compounds like it in BindingDB:
Activity Spreadsheet -- Enzyme Inhibition Constant Data from BindingDB
Found 1 hit for monomerid = 50384272
TargetRap guanine nucleotide exchange factor 4(Homo sapiens (Human))
University Of Texas Medical Branch
Curated by ChEMBL
LigandPNGBDBM50384272(CHEMBL2030611)
Affinity DataIC50:  1.27E+4nM. Assay description: Competitive inhibition of Epac2 using fluorescent nucleotide analog 8-NBD-cAMP by fluorescence analysis
In DepthDetails ArticlePubMed