BDBM50384273 CHEMBL2030612
SMILES Cc1ccc(C)c(CSc2nc(C3CC3)c(C#N)c(=O)[nH]2)c1
InChI Key InChIKey=MRWYKBYCVJIIQJ-UHFFFAOYSA-N
Data  1 IC50
  Tab Delimited (TSV)   2D SDfile   Computed 3D by Vconf -m prep SDfile
Find this compound or compounds like it in BindingDB:
Activity Spreadsheet -- Enzyme Inhibition Constant Data from BindingDB
Found 1 hit for monomerid = 50384273
TargetRap guanine nucleotide exchange factor 4(Homo sapiens (Human))
University Of Texas Medical Branch
Curated by ChEMBL
LigandPNGBDBM50384273(CHEMBL2030612)
Affinity DataIC50:  4.00E+3nM. Assay description: Competitive inhibition of Epac2 using fluorescent nucleotide analog 8-NBD-cAMP by fluorescence analysis
In DepthDetails ArticlePubMed