BDBM50384428 CHEMBL2031491::US9896452, Example 8
SMILES C[C@@H]1CCCN([C@@H]1CNC(=O)c1cccc2cccnc12)C(=O)c1nc(C)sc1-c1ccccc1
InChI Key InChIKey=SRKVUFVTSRBFFN-WZONZLPQSA-N
Data  4 IC50
  Tab Delimited (TSV)   2D SDfile   Computed 3D by Vconf -m prep SDfile
Find this compound or compounds like it in BindingDB:
Activity Spreadsheet -- Enzyme Inhibition Constant Data from BindingDB
Found 4 hits for monomerid = 50384428
TargetOrexin receptor type 2(Homo sapiens (Human))
Scripps Florida
Curated by ChEMBL
LigandPNGBDBM50384428(CHEMBL2031491 | US9896452, Example 8)
Affinity DataIC50:  58nM. Assay description: Antagonist activity at OX2 receptor expressed in CHO cells assessed as inhibition of OXA-stimulated intracellular calcium mobilization after 30 mins ...
In DepthDetails ArticlePubMed
TargetOrexin receptor type 2(Homo sapiens (Human))
Scripps Florida
Curated by ChEMBL
LigandPNGBDBM50384428(CHEMBL2031491 | US9896452, Example 8)
Affinity DataIC50:  60nM. Assay description: Measurement of [Ca2+]i using a FLIPR: CHO-OX1 or CHO-OX2 cells are seeded into black-walled clear-base 384-well plates (Costar) at a density of 20,00...
In DepthDetails US Patent
TargetOrexin/Hypocretin receptor type 1(Homo sapiens (Human))
Eolas Therapeutics
US Patent
LigandPNGBDBM50384428(CHEMBL2031491 | US9896452, Example 8)
Affinity DataIC50:  3nM. Assay description: Measurement of [Ca2+]i using a FLIPR: CHO-OX1 or CHO-OX2 cells are seeded into black-walled clear-base 384-well plates (Costar) at a density of 20,00...
In DepthDetails US Patent
TargetOrexin/Hypocretin receptor type 1(Homo sapiens (Human))
Eolas Therapeutics
US Patent
LigandPNGBDBM50384428(CHEMBL2031491 | US9896452, Example 8)
Affinity DataIC50:  2nM. Assay description: Antagonist activity at OX1 receptor expressed in CHO cells assessed as inhibition of OXA-stimulated intracellular calcium mobilization after 30 mins ...
In DepthDetails ArticlePubMed