BDBM50384535 CHEMBL2036242
SMILES NC(=O)[C@@]12CC3CC(C1)[C@H](NC(=O)CN1CCCN(c4c(F)cc(F)cc4F)S1(=O)=O)C(C3)C2
InChI Key InChIKey=FSDWGADVUJNNKE-JPWRKOPWSA-N
Data  2 IC50
  Tab Delimited (TSV)   2D SDfile   Computed 3D by Vconf -m prep SDfile
Find this compound or compounds like it in BindingDB:
Activity Spreadsheet -- Enzyme Inhibition Constant Data from BindingDB
Found 2 hits for monomerid = 50384535
Target11-beta-hydroxysteroid dehydrogenase 1(Mus musculus (mouse))
TBA
Curated by ChEMBL
LigandPNGBDBM50384535(CHEMBL2036242)
Affinity DataIC50:  157nM. Assay description: Inhibition of mouse 11beta-HSD1 expressed in CHO-K1 cells using cortisone as substrate after 3 hrs by HTRF assay
In DepthDetails ArticlePubMed
Target11-beta-hydroxysteroid dehydrogenase 1(Homo sapiens (Human))
TBA
Curated by ChEMBL
LigandPNGBDBM50384535(CHEMBL2036242)
Affinity DataIC50:  20nM. Assay description: Inhibition of human 11beta-HSD1 expressed in CHO-K1 cells using cortisone as substrate after 3 hrs by HTRF assay
In DepthDetails ArticlePubMed