BDBM50384580 CHEMBL2036789::US9744172, Compound UNC00000490A
SMILES CNc1ncc2c(nn(CC3CCC(N)CC3)c2n1)-c1cccnc1
InChI Key InChIKey=RJSUQBZTJGZMTH-UHFFFAOYSA-N
Data  4 IC50
  Tab Delimited (TSV)   2D SDfile   Computed 3D by Vconf -m prep SDfile
Find this compound or compounds like it in BindingDB:
Activity Spreadsheet -- Enzyme Inhibition Constant Data from BindingDB
Found 4 hits for monomerid = 50384580
TargetTyrosine-protein kinase Mer(Homo sapiens (Human))
TBA
Curated by ChEMBL
LigandPNGBDBM50384580(CHEMBL2036789 | US9744172, Compound UNC00000490A)
Affinity DataIC50:  530nM. Assay description: Inhibition of Mer expressed in Escherichia coli BL21 (DE3) cells using EFPIYDFLPAKKK-CONH2 as substrate after 180 mins by microfluid capillary electr...
In DepthDetails ArticlePubMed
TargetTyrosine-protein kinase Mer(Homo sapiens (Human))
TBA
Curated by ChEMBL
LigandPNGBDBM50384580(CHEMBL2036789 | US9744172, Compound UNC00000490A)
Affinity DataIC50:  550nM. Assay description: The ectopic expression of Mer receptor tyrosine kinase (Mer) has been identified as a tumor cell survival gene product in Acute Lymphoblastic Leukemi...
In DepthDetails US Patent
TargetTyrosine-protein kinase receptor TYRO3(Homo sapiens (Human))
TBA
Curated by ChEMBL
LigandPNGBDBM50384580(CHEMBL2036789 | US9744172, Compound UNC00000490A)
Affinity DataIC50:  5.40E+3nM. Assay description: Inhibition of Tyro3 using EFPIYDFLPAKKK-CONH2 as substrate after 180 mins by microfluid capillary electrophoresis assay
In DepthDetails ArticlePubMed
TargetTyrosine-protein kinase receptor UFO(Homo sapiens (Human))
TBA
Curated by ChEMBL
LigandPNGBDBM50384580(CHEMBL2036789 | US9744172, Compound UNC00000490A)
Affinity DataIC50:  750nM. Assay description: Inhibition of Axl using KKKKEEIYFFF-CONH2 as substrate after 180 mins by microfluid capillary electrophoresis assay
In DepthDetails ArticlePubMed