BDBM50384663 CHEMBL2037021
SMILES CC1CNCCN1c1ccccc1NC(=O)c1csc(n1)-c1ccc2OCCc2c1
InChI Key InChIKey=INQYQIPIONHQKW-UHFFFAOYSA-N
Data  1 IC50
  Tab Delimited (TSV)   2D SDfile   Computed 3D by Vconf -m prep SDfile
Find this compound or compounds like it in BindingDB:
Activity Spreadsheet -- Enzyme Inhibition Constant Data from BindingDB
Found 1 hit for monomerid = 50384663
TargetSerine/threonine-protein kinase Chk1(Homo sapiens (Human))
TBA
Curated by ChEMBL
LigandPNGBDBM50384663(CHEMBL2037021)
Affinity DataIC50:  280nM. Assay description: Inhibition of recombinant His-tagged CHK1 using biotin-RSGLYRSPSMPENLNRPR as substrate after 1 hr by scintillation proximity assay
In DepthDetails ArticlePubMed