BDBM50384781 CHEMBL2037345
SMILES COc1ccc(CN=Nc2nc3ccccc3[nH]2)cc1OC
InChI Key InChIKey=NHBBCAHXEMUWND-UHFFFAOYSA-N
Data  1 IC50
  Tab Delimited (TSV)   2D SDfile   Computed 3D by Vconf -m prep SDfile
Find this compound or compounds like it in BindingDB:
Activity Spreadsheet -- Enzyme Inhibition Constant Data from BindingDB
Found 1 hit for monomerid = 50384781
TargetPolyunsaturated fatty acid 5-lipoxygenase(Homo sapiens (Human))
TBA
Curated by ChEMBL
LigandPNGBDBM50384781(CHEMBL2037345)
Affinity DataIC50:  8.10E+3nM. Assay description: Inhibition of recombinant 5-lipooxygenase expressed in Escherichia coli BL21 using arachidonic acid as substrate incubated for 15 mins prior to subst...
In DepthDetails ArticlePubMed