BDBM50384809 CHEMBL2037493
SMILES CC(C)C[C@H]1N([C@@H](C(=O)N2CCCC2)c2ccc(C)nc2)C(=O)[C@H](NC1=O)C1Cc2ccccc2C1
InChI Key InChIKey=HUOBIPNKELQTCX-TWJOJJKGSA-N
Data  1 KI
  Tab Delimited (TSV)   2D SDfile   Computed 3D by Vconf -m prep SDfile
Find this compound or compounds like it in BindingDB:
Activity Spreadsheet -- Enzyme Inhibition Constant Data from BindingDB
Found 1 hit for monomerid = 50384809
TargetOxytocin receptor(Homo sapiens (Human))
Glaxosmithkline
Curated by ChEMBL
LigandPNGBDBM50384809(CHEMBL2037493)
Affinity DataKi:  0.501nM. Assay description: Displacement of [3H]oxytocin from human oxytocin receptor
In DepthDetails ArticlePubMed