BDBM50384836 CHEMBL2037487
SMILES COc1ccc(cn1)[C@@H](N1[C@H](CC(C)C)C(=O)N[C@H](C2Cc3ccccc3C2)C1=O)C(=O)N1CCOCC1
InChI Key InChIKey=WIPNLHFZEWVSSF-LGPLSSKUSA-N
Data  1 KI
  Tab Delimited (TSV)   2D SDfile   Computed 3D by Vconf -m prep SDfile
Find this compound or compounds like it in BindingDB:
Activity Spreadsheet -- Enzyme Inhibition Constant Data from BindingDB
Found 1 hit for monomerid = 50384836
TargetOxytocin receptor(Homo sapiens (Human))
Glaxosmithkline
Curated by ChEMBL
LigandPNGBDBM50384836(CHEMBL2037487)
Affinity DataKi:  0.251nM. Assay description: Displacement of [3H]oxytocin from human oxytocin receptor
In DepthDetails ArticlePubMed