BDBM50384943 CHEMBL2036656
SMILES C[C@@H]1CCCN1CCCOc1ccc(cc1)C(=O)CN1CCN(CC1)C(=O)Oc1ccccc1
InChI Key InChIKey=GRFZPGMCACWDHE-JOCHJYFZSA-N
Data  2 KI
  Tab Delimited (TSV)   2D SDfile   Computed 3D by Vconf -m prep SDfile
Find this compound or compounds like it in BindingDB:
Activity Spreadsheet -- Enzyme Inhibition Constant Data from BindingDB
Found 2 hits for monomerid = 50384943
TargetHistamine H3 receptor(Homo sapiens (Human))
Cephalon
Curated by ChEMBL
LigandPNGBDBM50384943(CHEMBL2036656)
Affinity DataKi:  3.90nM. Assay description: Displacement of [3H]NAMH from human histamine H3 receptor expressed in CHO cells
In DepthDetails ArticlePubMed
TargetHistamine H3 receptor(Rattus norvegicus (rat))
Cephalon
Curated by ChEMBL
LigandPNGBDBM50384943(CHEMBL2036656)
Affinity DataKi:  6.90nM. Assay description: Displacement of [3H]NAMH from rat histamine H3 receptor expressed in CHO cells
In DepthDetails ArticlePubMed